EnderUNIX Team.


EnderUNIX İpucu

Arkadaşıma gönder , Ana Sayfa

[ qmail ]

"Solaris sistem üzerine vpopmail kurarken err.h hatası" - Afşin Taşkıran - (2006-04-01 03:13:43)   [3207]

Solaris kurulu bir makinede vpopmail 5.4.13 derlerken gmake sirasinda asagidaki hatalar aliniyor:


./makelib cdbmake.a cdbmake_pack.o cdbmake_hash.o \
cdbmake_add.o
gmake[2]: Leaving directory `/usr/local/src/vpopmail-5.4.13/cdb'
gmake[2]: Entering directory `/usr/local/src/vpopmail-5.4.13'
gcc -I. -I/usr/sfw/include/mysql -I. -I. -I. -fPIC -g -O2 -Wall -c -o
libvpopmail_a-vpopmail.o `test -f 'vpopmail.c' || echo './'`vpopmail.c
vpopmail.c:35:17: err.h: No such file or directory
vpopmail.c: In function `r_mkdir':
vpopmail.c:1822: warning: implicit declaration of function `warn'
gmake[2]: *** [libvpopmail_a-vpopmail.o] Error 1
gmake[2]: Leaving directory `/usr/local/src/vpopmail-5.4.13'
gmake[1]: *** [all-recursive] Error 1
gmake[1]: Leaving directory `/usr/local/src/vpopmail-5.4.13'
gmake: *** [all] Error 2



http://jeremy.kister.net/code/vpopmail-5.4.13-pound-err-inject.patch

adresindeki yama ile bu sorun cozulebilir. Ayrica bu yama uc adet yenilikle gelmektedir.

Arkadaşıma gönder , Ana Sayfa